BDBM50030659 CHEMBL3342116
SMILES CCOC(=O)c1c(C)nc2sc(C(=O)c3ccccc3)c(N)c2c1-c1cc(OC)c(OC)c(OC)c1
InChI Key InChIKey=YVAONDGDDPOVIC-UHFFFAOYSA-N
Data  2 EC50
  Tab Delimited (TSV)   2D SDfile   Computed 3D by Vconf -m prep SDfile
Find this compound or compounds like it in BindingDB:
Activity Spreadsheet -- Enzyme Inhibition Constant Data from BindingDB
Found 1 hit for monomerid = 50030659
TargetMultidrug resistance-associated protein 1(Homo sapiens (Human))
Institute Of Organic Synthesis
Curated by ChEMBL
LigandPNGBDBM50030659(CHEMBL3342116)
Affinity DataEC50:  5.20E+3nM. Assay description: Modulation of MRP1 mediated drug efflux in doxorubicin-resistant human H69 cells assessed as accumulation of calcein AM incubated for 15 mins prior t...
In DepthDetails ArticlePubMed